{"text_format":"1","workbook":"xlsx","n_sheets":4,"sheets":["Wordle","Stats","Param","Home"],"not_rendered":{"charts":1,"images":13,"macros":1,"external_links":0,"defined_names":13,"comments":0,"pivot_tables":0},"unopened":[],"bounds":{"document_bytes":16777216,"sheet_cells":100000,"rows_first":2000,"rows_last":500,"rows_between":2000,"halvings":0,"cell_chars":16384,"cell_head_chars":4096},"cells_cut":0,"cells_raw":0,"read":"whole","date_system":"1900"}

{"sheet":"Wordle","index":0,"n_rows":14,"n_cols":20,"rows_kept":14,"cut":false,"hidden":true,"merged":[]}
[null,null,null,null,null,null,null,null,null,null,null,null,"Wordle"]
[]
[]
[null,null,null,null,null,null,null,null,null,null,null,null,null,null,null,null,null,null,{"$f":"I4&K4&M4&O4&Q4","v":""},{"$f":"_xlfn.IFNA(MATCH(S4,tbl_db[DB_word],0),\"0\")","v":"0"}]
[]
[null,null,null,null,null,null,null,null,null,null,null,null,null,null,null,null,null,null,{"$f":"I6&K6&M6&O6&Q6","v":""},{"$f":"_xlfn.IFNA(MATCH(S6,tbl_db[DB_word],0),\"0\")","v":"0"}]
[]
[null,null,null,null,null,null,null,null,null,null,null,null,null,null,null,null,null,null,{"$f":"I8&K8&M8&O8&Q8","v":""},{"$f":"_xlfn.IFNA(MATCH(S8,tbl_db[DB_word],0),\"0\")","v":"0"}]
[]
[null,null,null,null,null,null,null,null,null,null,null,null,null,null,null,null,null,null,{"$f":"I10&K10&M10&O10&Q10","v":""},{"$f":"_xlfn.IFNA(MATCH(S10,tbl_db[DB_word],0),\"0\")","v":"0"}]
[]
[null,null,null,null,null,null,null,null,null,null,null,null,null,null,null,null,null,null,{"$f":"I12&K12&M12&O12&Q12","v":""},{"$f":"_xlfn.IFNA(MATCH(S12,tbl_db[DB_word],0),\"0\")","v":"0"}]
[]
[null,null,null,null,null,null,null,null,null,null,null,null,null,null,null,null,null,null,{"$f":"I14&K14&M14&O14&Q14","v":""},{"$f":"_xlfn.IFNA(MATCH(S14,tbl_db[DB_word],0),\"0\")","v":"0"}]

{"sheet":"Stats","index":1,"n_rows":258,"n_cols":19,"rows_kept":258,"cut":false,"hidden":true,"merged":[]}
[]
[null,"Date","Beginning","Daily_word","Flag_Play","Flag_Success","Flag_Fail","Streak","Daily_Streak","Nb_attempts",null,"Played","Win %","Current Streak","Daily Streak",null,null,"Nb attempt","Nb"]
[null,"2023-07-14",null,null,null,null,null,{"$f":"IF(tbl_stats[[#This Row],[Beginning]]=\"\",0,IF(tbl_stats[[#This Row],[Flag_Play]]=1,IF(tbl_stats[[#This Row],[Flag_Success]]=1,H2+1,0),H2))","v":0},{"$f":"IF(tbl_stats[[#This Row],[Beginning]]=1,0,IF(tbl_stats[[#This Row],[Flag_Success]]=1,I2+1,0))","v":0},null,null,{"$f":"SUM(tbl_stats[Flag_Play])","v":8},{"$f":"IF(SUM(tbl_stats[Flag_Play])=0,0,SUM(tbl_stats[Flag_Success])/SUM(tbl_stats[Flag_Play]))","v":1},{"$f":"_xlfn.IFNA(INDEX(tbl_stats[Streak],MATCH(Param!$D$3,tbl_stats[Date],0)),0)","v":0},{"$f":"_xlfn.IFNA(INDEX(tbl_stats[Daily_Streak],MATCH(Param!$D$3,tbl_stats[Date],0)),0)","v":0},null,null,6,{"$f":"COUNTIF(tbl_stats[Nb_attempts],tbl_guess_distribution[[#This Row],[Nb attempt]])","v":2}]
[null,"2023-07-15",0,"rally",1,1,null,{"$f":"IF(tbl_stats[[#This Row],[Beginning]]=\"\",0,IF(tbl_stats[[#This Row],[Flag_Play]]=1,IF(tbl_stats[[#This Row],[Flag_Success]]=1,H3+1,0),H3))","v":1},{"$f":"IF(tbl_stats[[#This Row],[Beginning]]=1,0,IF(tbl_stats[[#This Row],[Flag_Success]]=1,I3+1,0))","v":1},5,null,null,null,null,null,null,null,5,{"$f":"COUNTIF(tbl_stats[Nb_attempts],tbl_guess_distribution[[#This Row],[Nb attempt]])","v":3}]
[null,"2023-07-16",0,"photo",1,1,0,{"$f":"IF(tbl_stats[[#This Row],[Beginning]]=\"\",0,IF(tbl_stats[[#This Row],[Flag_Play]]=1,IF(tbl_stats[[#This Row],[Flag_Success]]=1,H4+1,0),H4))","v":2},{"$f":"IF(tbl_stats[[#This Row],[Beginning]]=1,0,IF(tbl_stats[[#This Row],[Flag_Success]]=1,I4+1,0))","v":2},4,null,null,null,null,null,null,null,4,{"$f":"COUNTIF(tbl_stats[Nb_attempts],tbl_guess_distribution[[#This Row],[Nb attempt]])","v":3}]
[null,"2023-07-17",0,"suing",1,1,0,{"$f":"IF(tbl_stats[[#This Row],[Beginning]]=\"\",0,IF(tbl_stats[[#This Row],[Flag_Play]]=1,IF(tbl_stats[[#This Row],[Flag_Success]]=1,H5+1,0),H5))","v":3},{"$f":"IF(tbl_stats[[#This Row],[Beginning]]=1,0,IF(tbl_stats[[#This Row],[Flag_Success]]=1,I5+1,0))","v":3},4,null,null,null,null,null,null,null,3,{"$f":"COUNTIF(tbl_stats[Nb_attempts],tbl_guess_distribution[[#This Row],[Nb attempt]])","v":0}]
[null,"2023-07-18",0,"truss",1,1,0,{"$f":"IF(tbl_stats[[#This Row],[Beginning]]=\"\",0,IF(tbl_stats[[#This Row],[Flag_Play]]=1,IF(tbl_stats[[#This Row],[Flag_Success]]=1,H6+1,0),H6))","v":4},{"$f":"IF(tbl_stats[[#This Row],[Beginning]]=1,0,IF(tbl_stats[[#This Row],[Flag_Success]]=1,I6+1,0))","v":4},5,null,null,null,null,null,null,null,2,{"$f":"COUNTIF(tbl_stats[Nb_attempts],tbl_guess_distribution[[#This Row],[Nb attempt]])","v":0}]
[null,"2023-07-19",0,"those",1,1,0,{"$f":"IF(tbl_stats[[#This Row],[Beginning]]=\"\",0,IF(tbl_stats[[#This Row],[Flag_Play]]=1,IF(tbl_stats[[#This Row],[Flag_Success]]=1,H7+1,0),H7))","v":5},{"$f":"IF(tbl_stats[[#This Row],[Beginning]]=1,0,IF(tbl_stats[[#This Row],[Flag_Success]]=1,I7+1,0))","v":5},6,null,null,null,null,null,null,null,1,{"$f":"COUNTIF(tbl_stats[Nb_attempts],tbl_guess_distribution[[#This Row],[Nb attempt]])","v":0}]
[null,"2023-07-20",null,null,null,null,null,{"$f":"IF(tbl_stats[[#This Row],[Beginning]]=\"\",0,IF(tbl_stats[[#This Row],[Flag_Play]]=1,IF(tbl_stats[[#This Row],[Flag_Success]]=1,H8+1,0),H8))","v":0},{"$f":"IF(tbl_stats[[#This Row],[Beginning]]=1,0,IF(tbl_stats[[#This Row],[Flag_Success]]=1,I8+1,0))","v":0}]
[null,"2023-07-21",null,null,null,null,null,{"$f":"IF(tbl_stats[[#This Row],[Beginning]]=\"\",0,IF(tbl_stats[[#This Row],[Flag_Play]]=1,IF(tbl_stats[[#This Row],[Flag_Success]]=1,H9+1,0),H9))","v":0},{"$f":"IF(tbl_stats[[#This Row],[Beginning]]=1,0,IF(tbl_stats[[#This Row],[Flag_Success]]=1,I9+1,0))","v":0}]
[null,"2023-07-22",null,null,null,null,null,{"$f":"IF(tbl_stats[[#This Row],[Beginning]]=\"\",0,IF(tbl_stats[[#This Row],[Flag_Play]]=1,IF(tbl_stats[[#This Row],[Flag_Success]]=1,H10+1,0),H10))","v":0},{"$f":"IF(tbl_stats[[#This Row],[Beginning]]=1,0,IF(tbl_stats[[#This Row],[Flag_Success]]=1,I10+1,0))","v":0}]
[null,"2023-07-23",null,null,null,null,null,{"$f":"IF(tbl_stats[[#This Row],[Beginning]]=\"\",0,IF(tbl_stats[[#This Row],[Flag_Play]]=1,IF(tbl_stats[[#This Row],[Flag_Success]]=1,H11+1,0),H11))","v":0},{"$f":"IF(tbl_stats[[#This Row],[Beginning]]=1,0,IF(tbl_stats[[#This Row],[Flag_Success]]=1,I11+1,0))","v":0}]
[null,"2023-07-24",null,null,null,null,null,{"$f":"IF(tbl_stats[[#This Row],[Beginning]]=\"\",0,IF(tbl_stats[[#This Row],[Flag_Play]]=1,IF(tbl_stats[[#This Row],[Flag_Success]]=1,H12+1,0),H12))","v":0},{"$f":"IF(tbl_stats[[#This Row],[Beginning]]=1,0,IF(tbl_stats[[#This Row],[Flag_Success]]=1,I12+1,0))","v":0}]
[null,"2023-07-25",null,null,null,null,null,{"$f":"IF(tbl_stats[[#This Row],[Beginning]]=\"\",0,IF(tbl_stats[[#This Row],[Flag_Play]]=1,IF(tbl_stats[[#This Row],[Flag_Success]]=1,H13+1,0),H13))","v":0},{"$f":"IF(tbl_stats[[#This Row],[Beginning]]=1,0,IF(tbl_stats[[#This Row],[Flag_Success]]=1,I13+1,0))","v":0}]
[null,"2023-07-26",null,null,null,null,null,{"$f":"IF(tbl_stats[[#This Row],[Beginning]]=\"\",0,IF(tbl_stats[[#This Row],[Flag_Play]]=1,IF(tbl_stats[[#This Row],[Flag_Success]]=1,H14+1,0),H14))","v":0},{"$f":"IF(tbl_stats[[#This Row],[Beginning]]=1,0,IF(tbl_stats[[#This Row],[Flag_Success]]=1,I14+1,0))","v":0}]
[null,"2023-07-27",null,null,null,null,null,{"$f":"IF(tbl_stats[[#This Row],[Beginning]]=\"\",0,IF(tbl_stats[[#This Row],[Flag_Play]]=1,IF(tbl_stats[[#This Row],[Flag_Success]]=1,H15+1,0),H15))","v":0},{"$f":"IF(tbl_stats[[#This Row],[Beginning]]=1,0,IF(tbl_stats[[#This Row],[Flag_Success]]=1,I15+1,0))","v":0}]
[null,"2023-07-28",null,null,null,null,null,{"$f":"IF(tbl_stats[[#This Row],[Beginning]]=\"\",0,IF(tbl_stats[[#This Row],[Flag_Play]]=1,IF(tbl_stats[[#This Row],[Flag_Success]]=1,H16+1,0),H16))","v":0},{"$f":"IF(tbl_stats[[#This Row],[Beginning]]=1,0,IF(tbl_stats[[#This Row],[Flag_Success]]=1,I16+1,0))","v":0}]
[null,"2023-07-29",null,null,null,null,null,{"$f":"IF(tbl_stats[[#This Row],[Beginning]]=\"\",0,IF(tbl_stats[[#This Row],[Flag_Play]]=1,IF(tbl_stats[[#This Row],[Flag_Success]]=1,H17+1,0),H17))","v":0},{"$f":"IF(tbl_stats[[#This Row],[Beginning]]=1,0,IF(tbl_stats[[#This Row],[Flag_Success]]=1,I17+1,0))","v":0}]
[null,"2023-07-30",null,null,null,null,null,{"$f":"IF(tbl_stats[[#This Row],[Beginning]]=\"\",0,IF(tbl_stats[[#This Row],[Flag_Play]]=1,IF(tbl_stats[[#This Row],[Flag_Success]]=1,H18+1,0),H18))","v":0},{"$f":"IF(tbl_stats[[#This Row],[Beginning]]=1,0,IF(tbl_stats[[#This Row],[Flag_Success]]=1,I18+1,0))","v":0}]
[null,"2023-07-31",null,null,null,null,null,{"$f":"IF(tbl_stats[[#This Row],[Beginning]]=\"\",0,IF(tbl_stats[[#This Row],[Flag_Play]]=1,IF(tbl_stats[[#This Row],[Flag_Success]]=1,H19+1,0),H19))","v":0},{"$f":"IF(tbl_stats[[#This Row],[Beginning]]=1,0,IF(tbl_stats[[#This Row],[Flag_Success]]=1,I19+1,0))","v":0}]
[null,"2023-08-01",null,null,null,null,null,{"$f":"IF(tbl_stats[[#This Row],[Beginning]]=\"\",0,IF(tbl_stats[[#This Row],[Flag_Play]]=1,IF(tbl_stats[[#This Row],[Flag_Success]]=1,H20+1,0),H20))","v":0},{"$f":"IF(tbl_stats[[#This Row],[Beginning]]=1,0,IF(tbl_stats[[#This Row],[Flag_Success]]=1,I20+1,0))","v":0}]
[null,"2023-08-02",null,null,null,null,null,{"$f":"IF(tbl_stats[[#This Row],[Beginning]]=\"\",0,IF(tbl_stats[[#This Row],[Flag_Play]]=1,IF(tbl_stats[[#This Row],[Flag_Success]]=1,H21+1,0),H21))","v":0},{"$f":"IF(tbl_stats[[#This Row],[Beginning]]=1,0,IF(tbl_stats[[#This Row],[Flag_Success]]=1,I21+1,0))","v":0}]
[null,"2023-08-03",null,null,null,null,null,{"$f":"IF(tbl_stats[[#This Row],[Beginning]]=\"\",0,IF(tbl_stats[[#This Row],[Flag_Play]]=1,IF(tbl_stats[[#This Row],[Flag_Success]]=1,H22+1,0),H22))","v":0},{"$f":"IF(tbl_stats[[#This Row],[Beginning]]=1,0,IF(tbl_stats[[#This Row],[Flag_Success]]=1,I22+1,0))","v":0}]
[null,"2023-08-04",null,null,null,null,null,{"$f":"IF(tbl_stats[[#This Row],[Beginning]]=\"\",0,IF(tbl_stats[[#This Row],[Flag_Play]]=1,IF(tbl_stats[[#This Row],[Flag_Success]]=1,H23+1,0),H23))","v":0},{"$f":"IF(tbl_stats[[#This Row],[Beginning]]=1,0,IF(tbl_stats[[#This Row],[Flag_Success]]=1,I23+1,0))","v":0}]
[null,"2023-08-05",null,null,null,null,null,{"$f":"IF(tbl_stats[[#This Row],[Beginning]]=\"\",0,IF(tbl_stats[[#This Row],[Flag_Play]]=1,IF(tbl_stats[[#This Row],[Flag_Success]]=1,H24+1,0),H24))","v":0},{"$f":"IF(tbl_stats[[#This Row],[Beginning]]=1,0,IF(tbl_stats[[#This Row],[Flag_Success]]=1,I24+1,0))","v":0}]
[null,"2023-08-06",null,null,null,null,null,{"$f":"IF(tbl_stats[[#This Row],[Beginning]]=\"\",0,IF(tbl_stats[[#This Row],[Flag_Play]]=1,IF(tbl_stats[[#This Row],[Flag_Success]]=1,H25+1,0),H25))","v":0},{"$f":"IF(tbl_stats[[#This Row],[Beginning]]=1,0,IF(tbl_stats[[#This Row],[Flag_Success]]=1,I25+1,0))","v":0}]
[null,"2023-08-07",null,null,null,null,null,{"$f":"IF(tbl_stats[[#This Row],[Beginning]]=\"\",0,IF(tbl_stats[[#This Row],[Flag_Play]]=1,IF(tbl_stats[[#This Row],[Flag_Success]]=1,H26+1,0),H26))","v":0},{"$f":"IF(tbl_stats[[#This Row],[Beginning]]=1,0,IF(tbl_stats[[#This Row],[Flag_Success]]=1,I26+1,0))","v":0}]
[null,"2023-08-08",null,null,null,null,null,{"$f":"IF(tbl_stats[[#This Row],[Beginning]]=\"\",0,IF(tbl_stats[[#This Row],[Flag_Play]]=1,IF(tbl_stats[[#This Row],[Flag_Success]]=1,H27+1,0),H27))","v":0},{"$f":"IF(tbl_stats[[#This Row],[Beginning]]=1,0,IF(tbl_stats[[#This Row],[Flag_Success]]=1,I27+1,0))","v":0}]
[null,"2023-08-09",null,null,null,null,null,{"$f":"IF(tbl_stats[[#This Row],[Beginning]]=\"\",0,IF(tbl_stats[[#This Row],[Flag_Play]]=1,IF(tbl_stats[[#This Row],[Flag_Success]]=1,H28+1,0),H28))","v":0},{"$f":"IF(tbl_stats[[#This Row],[Beginning]]=1,0,IF(tbl_stats[[#This Row],[Flag_Success]]=1,I28+1,0))","v":0}]
[null,"2023-08-10",null,null,null,null,null,{"$f":"IF(tbl_stats[[#This Row],[Beginning]]=\"\",0,IF(tbl_stats[[#This Row],[Flag_Play]]=1,IF(tbl_stats[[#This Row],[Flag_Success]]=1,H29+1,0),H29))","v":0},{"$f":"IF(tbl_stats[[#This Row],[Beginning]]=1,0,IF(tbl_stats[[#This Row],[Flag_Success]]=1,I29+1,0))","v":0}]
[null,"2023-08-11",null,null,null,null,null,{"$f":"IF(tbl_stats[[#This Row],[Beginning]]=\"\",0,IF(tbl_stats[[#This Row],[Flag_Play]]=1,IF(tbl_stats[[#This Row],[Flag_Success]]=1,H30+1,0),H30))","v":0},{"$f":"IF(tbl_stats[[#This Row],[Beginning]]=1,0,IF(tbl_stats[[#This Row],[Flag_Success]]=1,I30+1,0))","v":0}]
[null,"2023-08-12",null,null,null,null,null,{"$f":"IF(tbl_stats[[#This Row],[Beginning]]=\"\",0,IF(tbl_stats[[#This Row],[Flag_Play]]=1,IF(tbl_stats[[#This Row],[Flag_Success]]=1,H31+1,0),H31))","v":0},{"$f":"IF(tbl_stats[[#This Row],[Beginning]]=1,0,IF(tbl_stats[[#This Row],[Flag_Success]]=1,I31+1,0))","v":0}]
[null,"2023-08-13",null,null,null,null,null,{"$f":"IF(tbl_stats[[#This Row],[Beginning]]=\"\",0,IF(tbl_stats[[#This Row],[Flag_Play]]=1,IF(tbl_stats[[#This Row],[Flag_Success]]=1,H32+1,0),H32))","v":0},{"$f":"IF(tbl_stats[[#This Row],[Beginning]]=1,0,IF(tbl_stats[[#This Row],[Flag_Success]]=1,I32+1,0))","v":0}]
[null,"2023-08-14",null,null,null,null,null,{"$f":"IF(tbl_stats[[#This Row],[Beginning]]=\"\",0,IF(tbl_stats[[#This Row],[Flag_Play]]=1,IF(tbl_stats[[#This Row],[Flag_Success]]=1,H33+1,0),H33))","v":0},{"$f":"IF(tbl_stats[[#This Row],[Beginning]]=1,0,IF(tbl_stats[[#This Row],[Flag_Success]]=1,I33+1,0))","v":0}]
[null,"2023-08-15",null,null,null,null,null,{"$f":"IF(tbl_stats[[#This Row],[Beginning]]=\"\",0,IF(tbl_stats[[#This Row],[Flag_Play]]=1,IF(tbl_stats[[#This Row],[Flag_Success]]=1,H34+1,0),H34))","v":0},{"$f":"IF(tbl_stats[[#This Row],[Beginning]]=1,0,IF(tbl_stats[[#This Row],[Flag_Success]]=1,I34+1,0))","v":0}]
[null,"2023-08-16",null,null,null,null,null,{"$f":"IF(tbl_stats[[#This Row],[Beginning]]=\"\",0,IF(tbl_stats[[#This Row],[Flag_Play]]=1,IF(tbl_stats[[#This Row],[Flag_Success]]=1,H35+1,0),H35))","v":0},{"$f":"IF(tbl_stats[[#This Row],[Beginning]]=1,0,IF(tbl_stats[[#This Row],[Flag_Success]]=1,I35+1,0))","v":0}]
[null,"2023-08-17",null,null,null,null,null,{"$f":"IF(tbl_stats[[#This Row],[Beginning]]=\"\",0,IF(tbl_stats[[#This Row],[Flag_Play]]=1,IF(tbl_stats[[#This Row],[Flag_Success]]=1,H36+1,0),H36))","v":0},{"$f":"IF(tbl_stats[[#This Row],[Beginning]]=1,0,IF(tbl_stats[[#This Row],[Flag_Success]]=1,I36+1,0))","v":0}]
[null,"2023-08-18",null,null,null,null,null,{"$f":"IF(tbl_stats[[#This Row],[Beginning]]=\"\",0,IF(tbl_stats[[#This Row],[Flag_Play]]=1,IF(tbl_stats[[#This Row],[Flag_Success]]=1,H37+1,0),H37))","v":0},{"$f":"IF(tbl_stats[[#This Row],[Beginning]]=1,0,IF(tbl_stats[[#This Row],[Flag_Success]]=1,I37+1,0))","v":0}]
[null,"2023-08-19",null,null,null,null,null,{"$f":"IF(tbl_stats[[#This Row],[Beginning]]=\"\",0,IF(tbl_stats[[#This Row],[Flag_Play]]=1,IF(tbl_stats[[#This Row],[Flag_Success]]=1,H38+1,0),H38))","v":0},{"$f":"IF(tbl_stats[[#This Row],[Beginning]]=1,0,IF(tbl_stats[[#This Row],[Flag_Success]]=1,I38+1,0))","v":0}]
[null,"2023-08-20",null,null,null,null,null,{"$f":"IF(tbl_stats[[#This Row],[Beginning]]=\"\",0,IF(tbl_stats[[#This Row],[Flag_Play]]=1,IF(tbl_stats[[#This Row],[Flag_Success]]=1,H39+1,0),H39))","v":0},{"$f":"IF(tbl_stats[[#This Row],[Beginning]]=1,0,IF(tbl_stats[[#This Row],[Flag_Success]]=1,I39+1,0))","v":0}]
[null,"2023-08-21",null,null,null,null,null,{"$f":"IF(tbl_stats[[#This Row],[Beginning]]=\"\",0,IF(tbl_stats[[#This Row],[Flag_Play]]=1,IF(tbl_stats[[#This Row],[Flag_Success]]=1,H40+1,0),H40))","v":0},{"$f":"IF(tbl_stats[[#This Row],[Beginning]]=1,0,IF(tbl_stats[[#This Row],[Flag_Success]]=1,I40+1,0))","v":0}]
[null,"2023-08-22",null,null,null,null,null,{"$f":"IF(tbl_stats[[#This Row],[Beginning]]=\"\",0,IF(tbl_stats[[#This Row],[Flag_Play]]=1,IF(tbl_stats[[#This Row],[Flag_Success]]=1,H41+1,0),H41))","v":0},{"$f":"IF(tbl_stats[[#This Row],[Beginning]]=1,0,IF(tbl_stats[[#This Row],[Flag_Success]]=1,I41+1,0))","v":0}]
[null,"2023-08-23",null,null,null,null,null,{"$f":"IF(tbl_stats[[#This Row],[Beginning]]=\"\",0,IF(tbl_stats[[#This Row],[Flag_Play]]=1,IF(tbl_stats[[#This Row],[Flag_Success]]=1,H42+1,0),H42))","v":0},{"$f":"IF(tbl_stats[[#This Row],[Beginning]]=1,0,IF(tbl_stats[[#This Row],[Flag_Success]]=1,I42+1,0))","v":0}]
[null,"2023-08-24",null,null,null,null,null,{"$f":"IF(tbl_stats[[#This Row],[Beginning]]=\"\",0,IF(tbl_stats[[#This Row],[Flag_Play]]=1,IF(tbl_stats[[#This Row],[Flag_Success]]=1,H43+1,0),H43))","v":0},{"$f":"IF(tbl_stats[[#This Row],[Beginning]]=1,0,IF(tbl_stats[[#This Row],[Flag_Success]]=1,I43+1,0))","v":0}]
[null,"2023-08-25",null,null,null,null,null,{"$f":"IF(tbl_stats[[#This Row],[Beginning]]=\"\",0,IF(tbl_stats[[#This Row],[Flag_Play]]=1,IF(tbl_stats[[#This Row],[Flag_Success]]=1,H44+1,0),H44))","v":0},{"$f":"IF(tbl_stats[[#This Row],[Beginning]]=1,0,IF(tbl_stats[[#This Row],[Flag_Success]]=1,I44+1,0))","v":0}]
[null,"2023-08-26",null,null,null,null,null,{"$f":"IF(tbl_stats[[#This Row],[Beginning]]=\"\",0,IF(tbl_stats[[#This Row],[Flag_Play]]=1,IF(tbl_stats[[#This Row],[Flag_Success]]=1,H45+1,0),H45))","v":0},{"$f":"IF(tbl_stats[[#This Row],[Beginning]]=1,0,IF(tbl_stats[[#This Row],[Flag_Success]]=1,I45+1,0))","v":0}]
[null,"2023-08-27",null,null,null,null,null,{"$f":"IF(tbl_stats[[#This Row],[Beginning]]=\"\",0,IF(tbl_stats[[#This Row],[Flag_Play]]=1,IF(tbl_stats[[#This Row],[Flag_Success]]=1,H46+1,0),H46))","v":0},{"$f":"IF(tbl_stats[[#This Row],[Beginning]]=1,0,IF(tbl_stats[[#This Row],[Flag_Success]]=1,I46+1,0))","v":0}]
[null,"2023-08-28",null,null,null,null,null,{"$f":"IF(tbl_stats[[#This Row],[Beginning]]=\"\",0,IF(tbl_stats[[#This Row],[Flag_Play]]=1,IF(tbl_stats[[#This Row],[Flag_Success]]=1,H47+1,0),H47))","v":0},{"$f":"IF(tbl_stats[[#This Row],[Beginning]]=1,0,IF(tbl_stats[[#This Row],[Flag_Success]]=1,I47+1,0))","v":0}]
[null,"2023-08-29",null,null,null,null,null,{"$f":"IF(tbl_stats[[#This Row],[Beginning]]=\"\",0,IF(tbl_stats[[#This Row],[Flag_Play]]=1,IF(tbl_stats[[#This Row],[Flag_Success]]=1,H48+1,0),H48))","v":0},{"$f":"IF(tbl_stats[[#This Row],[Beginning]]=1,0,IF(tbl_stats[[#This Row],[Flag_Success]]=1,I48+1,0))","v":0}]
[null,"2023-08-30",null,null,null,null,null,{"$f":"IF(tbl_stats[[#This Row],[Beginning]]=\"\",0,IF(tbl_stats[[#This Row],[Flag_Play]]=1,IF(tbl_stats[[#This Row],[Flag_Success]]=1,H49+1,0),H49))","v":0},{"$f":"IF(tbl_stats[[#This Row],[Beginning]]=1,0,IF(tbl_stats[[#This Row],[Flag_Success]]=1,I49+1,0))","v":0}]
[null,"2023-08-31",null,null,null,null,null,{"$f":"IF(tbl_stats[[#This Row],[Beginning]]=\"\",0,IF(tbl_stats[[#This Row],[Flag_Play]]=1,IF(tbl_stats[[#This Row],[Flag_Success]]=1,H50+1,0),H50))","v":0},{"$f":"IF(tbl_stats[[#This Row],[Beginning]]=1,0,IF(tbl_stats[[#This Row],[Flag_Success]]=1,I50+1,0))","v":0}]
[null,"2023-09-01",null,null,null,null,null,{"$f":"IF(tbl_stats[[#This Row],[Beginning]]=\"\",0,IF(tbl_stats[[#This Row],[Flag_Play]]=1,IF(tbl_stats[[#This Row],[Flag_Success]]=1,H51+1,0),H51))","v":0},{"$f":"IF(tbl_stats[[#This Row],[Beginning]]=1,0,IF(tbl_stats[[#This Row],[Flag_Success]]=1,I51+1,0))","v":0}]
[null,"2023-09-02",null,null,null,null,null,{"$f":"IF(tbl_stats[[#This Row],[Beginning]]=\"\",0,IF(tbl_stats[[#This Row],[Flag_Play]]=1,IF(tbl_stats[[#This Row],[Flag_Success]]=1,H52+1,0),H52))","v":0},{"$f":"IF(tbl_stats[[#This Row],[Beginning]]=1,0,IF(tbl_stats[[#This Row],[Flag_Success]]=1,I52+1,0))","v":0}]
[null,"2023-09-03",null,null,null,null,null,{"$f":"IF(tbl_stats[[#This Row],[Beginning]]=\"\",0,IF(tbl_stats[[#This Row],[Flag_Play]]=1,IF(tbl_stats[[#This Row],[Flag_Success]]=1,H53+1,0),H53))","v":0},{"$f":"IF(tbl_stats[[#This Row],[Beginning]]=1,0,IF(tbl_stats[[#This Row],[Flag_Success]]=1,I53+1,0))","v":0}]
[null,"2023-09-04",null,null,null,null,null,{"$f":"IF(tbl_stats[[#This Row],[Beginning]]=\"\",0,IF(tbl_stats[[#This Row],[Flag_Play]]=1,IF(tbl_stats[[#This Row],[Flag_Success]]=1,H54+1,0),H54))","v":0},{"$f":"IF(tbl_stats[[#This Row],[Beginning]]=1,0,IF(tbl_stats[[#This Row],[Flag_Success]]=1,I54+1,0))","v":0}]
[null,"2023-09-05",null,null,null,null,null,{"$f":"IF(tbl_stats[[#This Row],[Beginning]]=\"\",0,IF(tbl_stats[[#This Row],[Flag_Play]]=1,IF(tbl_stats[[#This Row],[Flag_Success]]=1,H55+1,0),H55))","v":0},{"$f":"IF(tbl_stats[[#This Row],[Beginning]]=1,0,IF(tbl_stats[[#This Row],[Flag_Success]]=1,I55+1,0))","v":0}]
[null,"2023-09-06",null,null,null,null,null,{"$f":"IF(tbl_stats[[#This Row],[Beginning]]=\"\",0,IF(tbl_stats[[#This Row],[Flag_Play]]=1,IF(tbl_stats[[#This Row],[Flag_Success]]=1,H56+1,0),H56))","v":0},{"$f":"IF(tbl_stats[[#This Row],[Beginning]]=1,0,IF(tbl_stats[[#This Row],[Flag_Success]]=1,I56+1,0))","v":0}]
[null,"2023-09-07",null,null,null,null,null,{"$f":"IF(tbl_stats[[#This Row],[Beginning]]=\"\",0,IF(tbl_stats[[#This Row],[Flag_Play]]=1,IF(tbl_stats[[#This Row],[Flag_Success]]=1,H57+1,0),H57))","v":0},{"$f":"IF(tbl_stats[[#This Row],[Beginning]]=1,0,IF(tbl_stats[[#This Row],[Flag_Success]]=1,I57+1,0))","v":0}]
[null,"2023-09-08",null,null,null,null,null,{"$f":"IF(tbl_stats[[#This Row],[Beginning]]=\"\",0,IF(tbl_stats[[#This Row],[Flag_Play]]=1,IF(tbl_stats[[#This Row],[Flag_Success]]=1,H58+1,0),H58))","v":0},{"$f":"IF(tbl_stats[[#This Row],[Beginning]]=1,0,IF(tbl_stats[[#This Row],[Flag_Success]]=1,I58+1,0))","v":0}]
[null,"2023-09-09",null,null,null,null,null,{"$f":"IF(tbl_stats[[#This Row],[Beginning]]=\"\",0,IF(tbl_stats[[#This Row],[Flag_Play]]=1,IF(tbl_stats[[#This Row],[Flag_Success]]=1,H59+1,0),H59))","v":0},{"$f":"IF(tbl_stats[[#This Row],[Beginning]]=1,0,IF(tbl_stats[[#This Row],[Flag_Success]]=1,I59+1,0))","v":0}]
{"$rows_left_out":199}
{"sheet":"Param","index":2,"n_rows":2313,"n_cols":16,"rows_kept":2313,"cut":false,"hidden":true,"merged":[]}
[]
[null,"Color",null,"Date",null,"Next Word",null,"Today_word",null,"DB_word",null,"Flag_Played_Today",null,"Today_Word_Display_Stat",null,"Language"]
[null,null,null,{"$f":"TODAY()","v":"2024-03-25"},null,null,null,{"$f":"_xlfn.IFNA(INDEX(tbl_stats[Daily_word],MATCH($D$3,tbl_stats[Date],0)),\"\")","v":"local"},null,"aback",null,{"$f":"_xlfn.IFNA(INDEX(tbl_stats[Flag_Play],MATCH($D$3,tbl_stats[Date],0)),0)","v":0},null,{"$f":"IF(Flag_Played_Today=1,today_word,\"?\")","v":"?"},null,"FR"]
[null,null,null,null,null,{"$f":"_xlfn.IFNA(MATCH(next_word,tbl_db[DB_word],0),\"Attention ce mot n'existe pas\")","v":"Attention ce mot n'existe pas"},null,null,null,"abase"]
[null,null,null,null,null,null,null,null,null,"abate"]
[null,null,null,null,null,null,null,null,null,"abbey"]
[null,null,null,null,null,null,null,null,null,"abbot"]
[null,null,null,null,null,null,null,null,null,"abhor"]
[null,null,null,null,null,null,null,null,null,"abide"]
[null,null,null,null,null,null,null,null,null,"abled"]
[null,null,null,null,null,null,null,null,null,"abode"]
[null,null,null,null,null,null,null,null,null,"abort"]
[null,null,null,null,null,null,null,null,null,"about"]
[null,null,null,null,null,null,null,null,null,"above"]
[null,null,null,null,null,null,null,null,null,"abuse"]
[null,null,null,null,null,null,null,null,null,"abyss"]
[null,null,null,null,null,null,null,null,null,"acorn"]
[null,null,null,null,null,null,null,null,null,"acrid"]
[null,null,null,null,null,null,null,null,null,"actor"]
[null,null,null,null,null,null,null,null,null,"acute"]
[null,null,null,null,null,null,null,null,null,"adage"]
[null,null,null,null,null,null,null,null,null,"adapt"]
[null,null,null,null,null,null,null,null,null,"adept"]
[null,null,null,null,null,null,null,null,null,"admin"]
[null,null,null,null,null,null,null,null,null,"admit"]
[null,null,null,null,null,null,null,null,null,"adobe"]
[null,null,null,null,null,null,null,null,null,"adopt"]
[null,null,null,null,null,null,null,null,null,"adore"]
[null,null,null,null,null,null,null,null,null,"adorn"]
[null,null,null,null,null,null,null,null,null,"adult"]
[null,null,null,null,null,null,null,null,null,"affix"]
[null,null,null,null,null,null,null,null,null,"afire"]
[null,null,null,null,null,null,null,null,null,"afoot"]
[null,null,null,null,null,null,null,null,null,"afoul"]
[null,null,null,null,null,null,null,null,null,"after"]
[null,null,null,null,null,null,null,null,null,"again"]
[null,null,null,null,null,null,null,null,null,"agape"]
[null,null,null,null,null,null,null,null,null,"agate"]
[null,null,null,null,null,null,null,null,null,"agent"]
[null,null,null,null,null,null,null,null,null,"agile"]
[null,null,null,null,null,null,null,null,null,"aging"]
[null,null,null,null,null,null,null,null,null,"aglow"]
[null,null,null,null,null,null,null,null,null,"agony"]
[null,null,null,null,null,null,null,null,null,"agree"]
[null,null,null,null,null,null,null,null,null,"ahead"]
[null,null,null,null,null,null,null,null,null,"aider"]
[null,null,null,null,null,null,null,null,null,"aisle"]
[null,null,null,null,null,null,null,null,null,"alarm"]
[null,null,null,null,null,null,null,null,null,"album"]
[null,null,null,null,null,null,null,null,null,"alert"]
[null,null,null,null,null,null,null,null,null,"algae"]
[null,null,null,null,null,null,null,null,null,"alibi"]
[null,null,null,null,null,null,null,null,null,"alien"]
[null,null,null,null,null,null,null,null,null,"align"]
[null,null,null,null,null,null,null,null,null,"alike"]
[null,null,null,null,null,null,null,null,null,"alive"]
[null,null,null,null,null,null,null,null,null,"allay"]
[null,null,null,null,null,null,null,null,null,"alley"]
[null,null,null,null,null,null,null,null,null,"allot"]
[null,null,null,null,null,null,null,null,null,"allow"]
{"$rows_left_out":2254}
{"sheet":"Home","index":3,"n_rows":0,"n_cols":0,"rows_kept":0,"cut":false,"hidden":false,"merged":[]}